Reaction Details
TargetHistone deacetylase 1
LigandBDBM50020908
Substrate/Competitorn/a
Meas. Tech.Enzyme Assay
IC50 22±n/a nM
Citation Nan, FChen, FZhang, YLi, JZhou, YSu, MDing, JMeng, LXie, XWang, S Thiazole compounds, methods for preparation and use thereof US Patent US9216962 Publication Date 12/22/2015
 
Histone deacetylase 1
Name:Histone deacetylase 1
Type:Enzyme
Mol. Mass.:55090.27
Organism:Homo sapiens (Human)
Description:Q13547
Residue:482
BDBM50020908
NameBDBM50020908
Synonyms:CHEMBL3287266 | US9216962, CFH367
TypeSmall organic molecule
Emp. Form.C15H18N4O3S2
Mol. Mass.366.458
SMILESC\C=C\c1sc(nc1C(=O)NCCCCC(=O)NO)-c1nccs1