Reaction Details
TargetD(1A) dopamine receptor
LigandBDBM160861
Substrate/Competitorn/a
Meas. Tech.Human D1 Receptor Binding Assay
pH7.4±n/a
Ki 3.61±n/a nM
Commentsextracted
Citation Brodney, MADavoren, JEDounay, ABEfremov, IVGray, DLGreen, MEHenderson, JLLee, CMente, SRO Neil, SVRogers, BNZhang, L Heteroaromatic compounds and their use as dopamine D1 ligands US Patent US10093655 Publication Date 10/9/2018
 
D(1A) dopamine receptor
Name:D(1A) dopamine receptor
Type:Enzyme
Mol. Mass.:49303.43
Organism:Homo sapiens (Human)
Description:P21728
Residue:446
BDBM160861
NameBDBM160861
Synonyms:US10093655, Example 31 US9107923, 31
TypeSmall organic molecule
Emp. Form.C19H18ClN3O3
Mol. Mass.371.818
SMILESCc1ccnc(Oc2ccc(c(C)c2)-c2c(C)c(=O)[nH]c(=O)n2C)c1Cl