Reaction Details
TargetD(1A) dopamine receptor
LigandBDBM160884
Substrate/Competitorn/a
Meas. Tech.Human D1 Receptor Binding Assay
pH7.4±n/a
Ki 9.33±n/a nM
Commentsextracted
Citation Brodney, MADavoren, JEDounay, ABEfremov, IVGray, DLGreen, MEHenderson, JLLee, CMente, SRO Neil, SVRogers, BNZhang, L Heteroaromatic compounds and their use as dopamine D1 ligands US Patent US10093655 Publication Date 10/9/2018
 
D(1A) dopamine receptor
Name:D(1A) dopamine receptor
Type:Enzyme
Mol. Mass.:49303.43
Organism:Homo sapiens (Human)
Description:P21728
Residue:446
BDBM160884
NameBDBM160884
Synonyms:US10093655, Example 55 US9107923, 54 | US9107923, 55
TypeSmall organic molecule
Emp. Form.C18H16ClN3O3
Mol. Mass.357.791
SMILESCc1cc(Oc2ncccc2Cl)ccc1-c1c(C)c(=O)[nH]c(=O)n1C