Reaction Details
TargetPhosphatidylinositol 4,5-bisphosphate 3-kinase catalytic subunit delta isoform
LigandBDBM198006
Substrate/Competitorn/a
Meas. Tech.Time-Resolved Fluorescence Resonance Energy transfer (TR-FRET) Assay
pH7.4±n/a
IC50 0.6±n/a nM
Commentsextracted
Citation Evarts, JKaplan, JKim, MPatel, LPerreault, SPhillips, GTreiberg, JAVan Veldhuizen, J Phosphatidylinositol 3-kinase inhibitors US Patent US9221795 Publication Date 12/29/2015
 
Phosphatidylinositol 4,5-bisphosphate 3-kinase catalytic subunit delta isoform
Name:Phosphatidylinositol 4,5-bisphosphate 3-kinase catalytic subunit delta isoform
Type:Enzyme Subunit
Mol. Mass.:119489.41
Organism:Homo sapiens (Human)
Description:O00329
Residue:1044
BDBM198006
NameBDBM198006
Synonyms:US9221795, 1
TypeSmall organic molecule
Emp. Form.C20H16ClN9O
Mol. Mass.433.854
SMILESC[C@H](Nc1nc(N)nc(N)c1C#N)c1nc2cccc(Cl)c2c(=O)n1-c1cccnc1