Reaction Details
TargetPhosphatidylinositol 4,5-bisphosphate 3-kinase catalytic subunit delta isoform
LigandBDBM198028
Substrate/Competitorn/a
Meas. Tech.Time-Resolved Fluorescence Resonance Energy transfer (TR-FRET) Assay
pH7.4±n/a
IC50 0.4±n/a nM
Commentsextracted
Citation Evarts, JKaplan, JKim, MPatel, LPerreault, SPhillips, GTreiberg, JAVan Veldhuizen, J Phosphatidylinositol 3-kinase inhibitors US Patent US9221795 Publication Date 12/29/2015
 
Phosphatidylinositol 4,5-bisphosphate 3-kinase catalytic subunit delta isoform
Name:Phosphatidylinositol 4,5-bisphosphate 3-kinase catalytic subunit delta isoform
Type:Enzyme Subunit
Mol. Mass.:119489.41
Organism:Homo sapiens (Human)
Description:O00329
Residue:1044
BDBM198028
NameBDBM198028
Synonyms:US9221795, 24
TypeSmall organic molecule
Emp. Form.C20H15ClFN9O
Mol. Mass.451.844
SMILESC[C@H](Nc1nc(N)nc(N)c1C#N)c1nc2c(F)ccc(Cl)c2c(=O)n1-c1cccnc1