Reaction Details
TargetComplement factor B
LigandBDBM159157
Substrate/Competitorn/a
Meas. Tech.Human Complement Factor B TR-FRET Assay
IC50 0.18±n/a nM
Citation Adams, CMCapparelli, MPEhara, TKarki, RGMainolfi, NZhang, C Piperidinyl-indole derivatives complement factor B inhibitors and uses thereof US Patent US9682968 Publication Date 6/20/2017
 
Complement factor B
Name:Complement factor B
Type:Enzyme
Mol. Mass.:85537.97
Organism:Homo sapiens (Human)
Description:P00751
Residue:764
BDBM159157
NameBDBM159157
Synonyms:US10093663, Example 5-4 | US9682968, Example-5-4
TypeSmall organic molecule
Emp. Form.C22H27N3O2S
Mol. Mass.397.534
SMILESCc1cc(C)c2[nH]ccc2c1CN1CCCCC1c1ccc(cc1)S(N)(=O)=O