Reaction Details
TargetComplement factor B
LigandBDBM159296
Substrate/Competitorn/a
Meas. Tech.Human Complement Factor B TR-FRET Assay
IC50 0.64±n/a nM
Citation Adams, CMCapparelli, MPEhara, TKarki, RGMainolfi, NZhang, C Piperidinyl-indole derivatives complement factor B inhibitors and uses thereof US Patent US9682968 Publication Date 6/20/2017
 
Complement factor B
Name:Complement factor B
Type:Enzyme
Mol. Mass.:85537.97
Organism:Homo sapiens (Human)
Description:P00751
Residue:764
BDBM159296
NameBDBM159296
Synonyms:US10093663, Example 9-2 | US9682968, Example-9-2
TypeSmall organic molecule
Emp. Form.C24H29N3O2
Mol. Mass.391.506
SMILESCOC1CCN(Cc2c(C)cc(C)c3[nH]ccc23)C(C1)c1ccc(cc1)C(N)=O