Reaction Details
TargetComplement factor B
LigandBDBM159379
Substrate/Competitorn/a
Meas. Tech.Human Complement Factor B TR-FRET Assay
IC50 0.07±n/a nM
Citation Adams, CMCapparelli, MPEhara, TKarki, RGMainolfi, NZhang, C Piperidinyl-indole derivatives complement factor B inhibitors and uses thereof US Patent US9682968 Publication Date 6/20/2017
 
Complement factor B
Name:Complement factor B
Type:Enzyme
Mol. Mass.:85537.97
Organism:Homo sapiens (Human)
Description:P00751
Residue:764
BDBM159379
NameBDBM159379
Synonyms:US10093663, Example 17-8 | US9682968, Example-17-8
TypeSmall organic molecule
Emp. Form.C23H25FN2O3
Mol. Mass.396.4546
SMILESCOc1cc(C)c2[nH]ccc2c1CN1CCCC[C@H]1c1ccc(cc1F)C(O)=O