Reaction Details
TargetComplement factor B
LigandBDBM159486
Substrate/Competitorn/a
Meas. Tech.Human Complement Factor B TR-FRET Assay
IC50 0.02±n/a nM
Citation Adams, CMCapparelli, MPEhara, TKarki, RGMainolfi, NZhang, C Piperidinyl-indole derivatives complement factor B inhibitors and uses thereof US Patent US9682968 Publication Date 6/20/2017
 
Complement factor B
Name:Complement factor B
Type:Enzyme
Mol. Mass.:85537.97
Organism:Homo sapiens (Human)
Description:P00751
Residue:764
BDBM159486
NameBDBM159486
Synonyms:US10093663, Example 17-11 | US9682968, Example-17-11
TypeSmall organic molecule
Emp. Form.C26H32N2O4
Mol. Mass.436.5433
SMILESCCCO[C@H]1CCN(Cc2c(OC)cc(C)c3[nH]ccc23)[C@@H](C1)c1ccc(cc1)C(O)=O