Reaction Details
TargetComplement factor B
LigandBDBM159873
Substrate/Competitorn/a
Meas. Tech.Human Complement Factor B TR-FRET Assay
IC50 0.04±n/a nM
Citation Adams, CMCapparelli, MPEhara, TKarki, RGMainolfi, NZhang, C Piperidinyl-indole derivatives complement factor B inhibitors and uses thereof US Patent US9682968 Publication Date 6/20/2017
 
Complement factor B
Name:Complement factor B
Type:Enzyme
Mol. Mass.:85537.97
Organism:Homo sapiens (Human)
Description:P00751
Residue:764
BDBM159873
NameBDBM159873
Synonyms:US10093663, Example 17-24 | US9682968, Example-17-24
TypeSmall organic molecule
Emp. Form.C25H28N4O
Mol. Mass.400.516
SMILESCOc1cc(C)c2[nH]ccc2c1CN1CCCC[C@H]1c1ccc(cc1)-c1cc[nH]n1