Reaction Details
TargetComplement factor B
LigandBDBM160480
Substrate/Competitorn/a
Meas. Tech.Human Complement Factor B TR-FRET Assay
IC50 0.02±n/a nM
Citation Adams, CMCapparelli, MPEhara, TKarki, RGMainolfi, NZhang, C Piperidinyl-indole derivatives complement factor B inhibitors and uses thereof US Patent US9682968 Publication Date 6/20/2017
 
Complement factor B
Name:Complement factor B
Type:Enzyme
Mol. Mass.:85537.97
Organism:Homo sapiens (Human)
Description:P00751
Residue:764
BDBM160480
NameBDBM160480
Synonyms:US9682968, Example-27-1b (-)
TypeSmall organic molecule
Emp. Form.C24H28N2O3
Mol. Mass.392.4907
SMILESCOC1CCN(Cc2c(C)cc(C)c3[nH]ccc23)C(C1)c1ccc(cc1)C(O)=O