Reaction Details
TargetComplement factor B
LigandBDBM160483
Substrate/Competitorn/a
Meas. Tech.Human Complement Factor B TR-FRET Assay
IC50 0.01±n/a nM
Citation Adams, CMCapparelli, MPEhara, TKarki, RGMainolfi, NZhang, C Piperidinyl-indole derivatives complement factor B inhibitors and uses thereof US Patent US9682968 Publication Date 6/20/2017
 
Complement factor B
Name:Complement factor B
Type:Enzyme
Mol. Mass.:85537.97
Organism:Homo sapiens (Human)
Description:P00751
Residue:764
BDBM160483
NameBDBM160483
Synonyms:US9682968, Example-27-3a (-)
TypeSmall organic molecule
Emp. Form.C26H30N2O3
Mol. Mass.418.528
SMILESCOC1CCN(Cc2c(cc(C)c3[nH]ccc23)C2CC2)C(C1)c1ccc(cc1)C(O)=O