Reaction Details
TargetMacrophage colony-stimulating factor 1 receptor [555-568]
LigandBDBM198890
Substrate/Competitorn/a
Meas. Tech.Fluorescence Polarization Competition Immunoassay
pH7.5±n/a
IC50 1.7±n/a nM
Commentsextracted
Citation Illig, CRBallentine, SKChen, JDesjarlais, RLMeegalla, SKWall, MWilson, K Inhibitors of c-fms kinase US Patent US9221797 Publication Date 12/29/2015
 
Macrophage colony-stimulating factor 1 receptor [555-568]
Name:Macrophage colony-stimulating factor 1 receptor [555-568]
Type:Peptide
Mol. Mass.:1619.64
Organism:Homo sapiens (Human)
Description:P07333 aa 555-568
Residue:14
SYEGNSYTFIDPTQ
BDBM198890
NameBDBM198890
Synonyms:US9221797, 75
TypeSmall organic molecule
Emp. Form.C28H36N6O2
Mol. Mass.488.6244
SMILESCC(=O)N1CCN(CC1)C(C)(C)c1ccc(NC(=O)c2nc(c[nH]2)C#N)c(c1)C1=CCC(C)(C)CC1