Reaction Details
TargetMacrophage colony-stimulating factor 1 receptor [555-568]
LigandBDBM198893
Substrate/Competitorn/a
Meas. Tech.Fluorescence Polarization Competition Immunoassay
pH7.5±n/a
IC50 2±n/a nM
Commentsextracted
Citation Illig, CRBallentine, SKChen, JDesjarlais, RLMeegalla, SKWall, MWilson, K Inhibitors of c-fms kinase US Patent US9221797 Publication Date 12/29/2015
 
Macrophage colony-stimulating factor 1 receptor [555-568]
Name:Macrophage colony-stimulating factor 1 receptor [555-568]
Type:Peptide
Mol. Mass.:1619.64
Organism:Homo sapiens (Human)
Description:P07333 aa 555-568
Residue:14
SYEGNSYTFIDPTQ
BDBM198893
NameBDBM198893
Synonyms:US9221797, 79
TypeSmall organic molecule
Emp. Form.C30H40N6O3
Mol. Mass.532.677
SMILESCCOC(=O)CN1CCN(CC1)C(C)(C)c1ccc(NC(=O)c2nc(c[nH]2)C#N)c(c1)C1=CCC(C)(C)CC1