Reaction Details
TargetMacrophage colony-stimulating factor 1 receptor [555-568]
LigandBDBM198902
Substrate/Competitorn/a
Meas. Tech.Fluorescence Polarization Competition Immunoassay
pH7.5±n/a
IC50 3.5±n/a nM
Commentsextracted
Citation Illig, CRBallentine, SKChen, JDesjarlais, RLMeegalla, SKWall, MWilson, K Inhibitors of c-fms kinase US Patent US9221797 Publication Date 12/29/2015
 
Macrophage colony-stimulating factor 1 receptor [555-568]
Name:Macrophage colony-stimulating factor 1 receptor [555-568]
Type:Peptide
Mol. Mass.:1619.64
Organism:Homo sapiens (Human)
Description:P07333 aa 555-568
Residue:14
SYEGNSYTFIDPTQ
BDBM198902
NameBDBM198902
Synonyms:US9221797, 145
TypeSmall organic molecule
Emp. Form.C27H35N5O3S
Mol. Mass.509.664
SMILESCC(C)(CN1CCS(=O)(=O)CC1)c1ccc(NC(=O)c2nc(c[nH]2)C#N)c(c1)C1=CCC(C)(C)CC1