Reaction Details
TargetIsoform 1 of Metabotropic glutamate receptor 5 (5a)
LigandBDBM198917
Substrate/Competitorn/a
Meas. Tech.Intracellular Ca2+ Mobilization Assay
Temperature310.15±n/a K
EC50 10±n/a nM
Commentsextracted
Citation Jaeschke, GLindemann, LStadler, HVieira, E Arylethynyl derivatives US Patent US9221802 Publication Date 12/29/2015
 
Isoform 1 of Metabotropic glutamate receptor 5 (5a)
Name:Isoform 1 of Metabotropic glutamate receptor 5 (5a)
Type:Enzyme
Mol. Mass.:128885.13
Organism:Homo sapiens (Human)
Description:P41594-2
Residue:1180
BDBM198917
NameBDBM198917
Synonyms:US9221802, Ex. 3
TypeSmall organic molecule
Emp. Form.C20H17FN2O2
Mol. Mass.336.3596
SMILESFc1ccc(cc1)C#Cc1ccc(nc1)N1[C@@H]2CCC[C@@H]2COC1=O