Reaction Details
TargetTyrosine--tRNA ligase
LigandBDBM199131
Substrate/Competitorn/a
Meas. Tech.In vitro Enzyme Inhibition Assay
pH7.9±n/a
IC50 5.601e+4± 2.2e+2 nM
Commentsextracted
Citation Chen, LWWang, PFTang, DJTao, XXMan, RJQiu, HYWang, ZCXu, CZhu, HL Metronidazole containing pyrazole derivatives potently inhibit tyrosyl-tRNA synthetase: design, synthesis, and biological evaluation. Chem Biol Drug Des88:592-8 (2016) 
 
Tyrosine--tRNA ligase
Name:Tyrosine--tRNA ligase
Type:Protein
Mol. Mass.:47586.43
Organism:Staphylococcus aureus (strain MSSA476)
Description:n/a
Residue:420
BDBM199131
NameBDBM199131
Synonyms:2-(2-Methyl-5-nitro-1H-imidazol-1-yl)-ethyl-5-(4-fluorophenyl)-1-(p-tolyl)-1H-pyrazole-3-carboxylate (4c)
TypeSmall organic molecule
Emp. Form.C23H20FN5O4
Mol. Mass.449.4344
SMILESCc1ncc(n1CCOC(=O)c1cc(-c2ccc(F)cc2)n(n1)-c1ccc(C)cc1)[N+]([O-])=O