Reaction Details
TargetTyrosine--tRNA ligase
LigandBDBM199147
Substrate/Competitorn/a
Meas. Tech.In vitro Enzyme Inhibition Assay
pH7.9±n/a
IC50 1.648e+4± 2.4e+2 nM
Commentsextracted
Citation Chen, LWWang, PFTang, DJTao, XXMan, RJQiu, HYWang, ZCXu, CZhu, HL Metronidazole containing pyrazole derivatives potently inhibit tyrosyl-tRNA synthetase: design, synthesis, and biological evaluation. Chem Biol Drug Des88:592-8 (2016) 
 
Tyrosine--tRNA ligase
Name:Tyrosine--tRNA ligase
Type:Protein
Mol. Mass.:47586.43
Organism:Staphylococcus aureus (strain MSSA476)
Description:n/a
Residue:420
BDBM199147
NameBDBM199147
Synonyms:2-(2-Methyl-5-nitro-1H-imidazol-1-yl)-ethyl-1-(4-chlorophenyl)-5-phenyl-1H-pyrazole-3-carboxylate (4s)
TypeSmall organic molecule
Emp. Form.C22H18ClN5O4
Mol. Mass.451.862
SMILESCc1ncc(n1CCOC(=O)c1cc(-c2ccccc2)n(n1)-c1ccc(Cl)cc1)[N+]([O-])=O