Reaction Details
TargetTyrosine-protein phosphatase non-receptor type 2
LigandBDBM199177
Substrate/Competitorn/a
Meas. Tech.PTP pNPP Assay
pH7±n/a
Temperature298.15±n/a K
IC50 2000±0.0 nM
Commentsextracted
Citation Zhang, ZZhang, S Inhibitors of protein tyrosine phosphatases US Patent US9217012 Publication Date 12/22/2015
 
Tyrosine-protein phosphatase non-receptor type 2
Name:Tyrosine-protein phosphatase non-receptor type 2
Type:Protein
Mol. Mass.:48481.80
Organism:Homo sapiens (Human)
Description:P17706
Residue:415
BDBM199177
NameBDBM199177
Synonyms:US9217012, 4
TypeSmall organic molecule
Emp. Form.C20H29F2N4O7P
Mol. Mass.506.4374
SMILESCC(=O)NCCCCC(NC(=O)C(Cc1ccc(cc1)C(F)(F)P(O)(O)=O)NC(C)=O)C(N)=O