Reaction Details
TargetEndothelial lipase
LigandBDBM199213
Substrate/Competitorn/a
Meas. Tech.Endothelial Lipase Assay
pH7.2±n/a
IC50 2017±n/a nM
Commentsextracted
Citation Connelly, MAGreco, MYe, H Tricyclic indole derivatives useful endothelial lipase inhibitors US Patent US9216998 Publication Date 12/22/2015
 
Endothelial lipase
Name:Endothelial lipase
Type:Protein
Mol. Mass.:56805.62
Organism:Homo sapiens (Human)
Description:Q9Y5X9
Residue:500
BDBM199213
NameBDBM199213
Synonyms:US9216998, 18
TypeSmall organic molecule
Emp. Form.C22H22F3N3O
Mol. Mass.401.4248
SMILESNCC(=O)N1CCn2c(CCc3ccccc3)c(c3cccc(C1)c23)C(F)(F)F