Reaction Details
TargetEndothelial lipase
LigandBDBM50443625
Substrate/Competitorn/a
Meas. Tech.Endothelial Lipase Assay
pH7.2±n/a
IC50 39±n/a nM
Commentsextracted
Citation Connelly, MAGreco, MYe, H Tricyclic indole derivatives useful endothelial lipase inhibitors US Patent US9216998 Publication Date 12/22/2015
 
Endothelial lipase
Name:Endothelial lipase
Type:Protein
Mol. Mass.:56805.62
Organism:Homo sapiens (Human)
Description:Q9Y5X9
Residue:500
BDBM50443625
NameBDBM50443625
Synonyms:CHEMBL3092448 | US9216998, 25
TypeSmall organic molecule
Emp. Form.C19H16F3NO
Mol. Mass.331.3316
SMILESFC(F)(F)c1c(CCc2ccccc2)n2CCOc3cccc1c23