Reaction Details
TargetEndothelial lipase
LigandBDBM199210
Substrate/Competitorn/a
Meas. Tech.Endothelial Lipase Assay
pH7.2±n/a
IC50 162±n/a nM
Commentsextracted
Citation Connelly, MAGreco, MYe, H Tricyclic indole derivatives useful endothelial lipase inhibitors US Patent US9216998 Publication Date 12/22/2015
 
Endothelial lipase
Name:Endothelial lipase
Type:Protein
Mol. Mass.:56643.58
Organism:Mus musculus (Mouse)
Description:Q9WVG5
Residue:500
BDBM199210
NameBDBM199210
Synonyms:US9216998, 14
TypeSmall organic molecule
Emp. Form.C27H24F3N3O
Mol. Mass.463.4942
SMILESFC(F)(F)c1c(CCc2ccccc2)n2CCN(Cc3cccc1c23)C(=O)Nc1ccccc1