Reaction Details
TargetEndothelial lipase
LigandBDBM199206
Substrate/Competitorn/a
Meas. Tech.Endothelial Lipase Assay
pH7.2±n/a
IC50 677±n/a nM
Commentsextracted
Citation Connelly, MAGreco, MYe, H Tricyclic indole derivatives useful endothelial lipase inhibitors US Patent US9216998 Publication Date 12/22/2015
 
Endothelial lipase
Name:Endothelial lipase
Type:Protein
Mol. Mass.:56643.58
Organism:Mus musculus (Mouse)
Description:Q9WVG5
Residue:500
BDBM199206
NameBDBM199206
Synonyms:US9216998, 15
TypeSmall organic molecule
Emp. Form.C20H19F3N2
Mol. Mass.344.3735
SMILESFC(F)(F)c1c(CCc2ccccc2)n2CCNCc3cccc1c23