Reaction Details
TargetIsoform 1 of Metabotropic glutamate receptor 5 (5a)
LigandBDBM199985
Substrate/Competitorn/a
Meas. Tech.Binding Assay
pH7.4±n/a
Ki 201±0.0 nM
Commentsextracted
Citation Jaeschke, GLindemann, LRicci, ARueher, DStadler, HVieira, E Ethynyl derivatives US Patent US9227959 Publication Date 1/5/2016
 
Isoform 1 of Metabotropic glutamate receptor 5 (5a)
Name:Isoform 1 of Metabotropic glutamate receptor 5 (5a)
Type:Enzyme
Mol. Mass.:128885.13
Organism:Homo sapiens (Human)
Description:P41594-2
Residue:1180
BDBM199985
NameBDBM199985
Synonyms:US9227959, Reference Compound 1, Ex. 35
TypeSmall organic molecule
Emp. Form.C20H19FN2O2
Mol. Mass.338.3755
SMILESCC1(C)CN(CCO1)C(=O)c1ccc(cn1)C#Cc1cccc(F)c1