Reaction Details
TargetAldo-keto reductase family 1 member B10
LigandBDBM16314
Substrate/Competitorn/a
Meas. Tech.IC50-Activity Assay (AKR1B10)
pH7±n/a
IC50 1.2±n/a nM
Commentsextracted
Citation Cousido-Siah, ARuiz, FXFranflík, JGiménez-Dejoz, JMitschler, AKamlar, MVesely´, JAjani, HParés, XFarrés, JHobza, PPodjarny, AD IDD388 Polyhalogenated Derivatives as Probes for an Improved Structure-Based Selectivity of AKR1B10 Inhibitors ACS Chem Biol11:2693-2705 (2016) 
 
Aldo-keto reductase family 1 member B10
Name:Aldo-keto reductase family 1 member B10
Type:Protein
Mol. Mass.:36024.67
Organism:Homo sapiens (Human)
Description:O60218. 1ZUA; 4JII; 4GQ0
Residue:316
BDBM16314
NameBDBM16314
Synonyms:2-{[6-methoxy-5-(trifluoromethyl)naphthalen-1-yl]-N-methylmethanethioamido}acetic acid CHEMBL436 Tolrestat
TypeSmall organic molecule
Emp. Form.C16H14F3NO3S
Mol. Mass.357.347
SMILESCOc1ccc2c(cccc2c1C(F)(F)F)C(=S)N(C)CC(O)=O