Reaction Details
TargetELAV-like protein 1 [I180A]
LigandBDBM283
Substrate/Competitorn/a
IC50 41900±n/a nM
Citation PubChem, PC Identify HuR specific inhibitors PubChem Bioassay(2015)[AID]
 
ELAV-like protein 1 [I180A]
Name:ELAV-like protein 1 [I180A]
Type:Enzyme Catalytic Domain
Mol. Mass.:36072.53
Organism:Homo sapiens (Human)
Description:gi_1022961
Residue:326
BDBM283
NameBDBM283
Synonyms:6-[(8-chloro-4-hydroxy-3-{[4-hydroxy-3-(3-methylbut-2-en-1-yl)benzene]amido}-2-oxo-2H-chromen-7-yl)oxy]-5-hydroxy-3-methoxy-2,2-dimethyloxan-4-yl 5-methyl-1H-pyrrole-2-carboxylate Coumarin-Based, DNA Gyrase Inhibitor | cid_54677920
TypeAntibiotic
Emp. Form.C35H37ClN2O11
Mol. Mass.697.128
SMILESCOC1C(OC(=O)c2ccc(C)[nH]2)C(O)C(Oc2ccc3c(O)c(NC(=O)c4ccc(O)c(CC=C(C)C)c4)c(=O)oc3c2Cl)OC1(C)C