Reaction Details
TargetAmyloid-beta precursor protein
LigandBDBM200307
Substrate/Competitorn/a
Meas. Tech.Electrochemiluminescence (ECL)-based Immunoassay
pH7±n/a
Temperature310.15±n/a K
IC50 4.5±n/a nM
Commentsextracted
Citation Wu, WBurnett, DA Gamma secretase inhibitors US Patent US9226927 Publication Date 1/5/2016
 
Amyloid-beta precursor protein
Name:Amyloid-beta precursor protein
Type:Single-pass type I membrane protein
Mol. Mass.:86890.41
Organism:Homo sapiens (Human)
Description:P05067
Residue:770
BDBM200307
NameBDBM200307
Synonyms:US9226927, 25b
TypeSmall organic molecule
Emp. Form.C24H21ClF2N2O6S2
Mol. Mass.571.013
SMILESFc1ccc(F)c2c1OCC1[C@H](CCS(=O)(=O)c3cccnn3)OCC[C@@]21S(=O)(=O)c1ccc(Cl)cc1