Reaction Details
TargetProprotein convertase subtilisin/kexin type 9
LigandBDBM200317
Substrate/Competitorn/a
Meas. Tech.Cell Free Assay
IC50 690±n/a nM
Citation Darout, EDullea, RHawkins, JJLondregan, ATLoria, PMMaguire, BMcClure, KFPetersen, DNPiotrowski, DW Substituted amide compounds US Patent US9227956 Publication Date 1/5/2016
 
Proprotein convertase subtilisin/kexin type 9
Name:Proprotein convertase subtilisin/kexin type 9
Type:Enzyme
Mol. Mass.:74286.93
Organism:Homo sapiens (Human)
Description:Q8NBP7
Residue:692
BDBM200317
NameBDBM200317
Synonyms:US9227956, 2
TypeSmall organic molecule
Emp. Form.C23H21ClN6O
Mol. Mass.432.905
SMILESClc1cccnc1N([C@@H]1CCCNC1)C(=O)c1ccc(cc1)-c1cnn2cccnc12