Reaction Details
TargetProprotein convertase subtilisin/kexin type 9
LigandBDBM200341
Substrate/Competitorn/a
Meas. Tech.Cell Free Assay
IC50 2970±n/a nM
Citation Darout, EDullea, RHawkins, JJLondregan, ATLoria, PMMaguire, BMcClure, KFPetersen, DNPiotrowski, DW Substituted amide compounds US Patent US9227956 Publication Date 1/5/2016
 
Proprotein convertase subtilisin/kexin type 9
Name:Proprotein convertase subtilisin/kexin type 9
Type:Enzyme
Mol. Mass.:74286.93
Organism:Homo sapiens (Human)
Description:Q8NBP7
Residue:692
BDBM200341
NameBDBM200341
Synonyms:US9227956, 25
TypeSmall organic molecule
Emp. Form.C22H23ClN6O3
Mol. Mass.454.909
SMILESCn1ncc(c1C(=O)NO)-c1ccc(cc1)C(=O)N([C@@H]1CCCNC1)c1ncccc1Cl