Reaction Details
TargetAlpha-1,6-mannosyl-glycoprotein 2-beta-N-acetylglucosaminyltransferase
LigandBDBM201239
Substrate/Competitorn/a
Meas. Tech.MGAT LCMS Assay
pH7.4±n/a
IC50 2±n/a nM
Commentsextracted
Citation Turdi, HHangeland, JJLawrence, RMCheng, DAhmad, SMeng, WBrigance, RPDevasthale, PZhao, G Aryl dihydropyridinones and piperidinone MGAT2 inhibitors US Patent US9187424 Publication Date 11/17/2015
 
Alpha-1,6-mannosyl-glycoprotein 2-beta-N-acetylglucosaminyltransferase
Name:Alpha-1,6-mannosyl-glycoprotein 2-beta-N-acetylglucosaminyltransferase
Type:n/a
Mol. Mass.:51567.80
Organism:Homo sapiens (Human)
Description:Q10469
Residue:447
BDBM201239
NameBDBM201239
Synonyms:US9187424, 6-2
TypeSmall organic molecule
Emp. Form.C31H28F6N2O4
Mol. Mass.606.5554
SMILESCOc1ccc(NC(=O)C2=C(C[C@](NC2=O)(c2ccc(OCCCC(F)(F)F)cc2)C(F)(F)F)c2ccc(C)cc2)cc1