Reaction Details
TargetAlpha-1,6-mannosyl-glycoprotein 2-beta-N-acetylglucosaminyltransferase
LigandBDBM201317
Substrate/Competitorn/a
Meas. Tech.MGAT LCMS Assay
pH7.4±n/a
IC50 2±n/a nM
Commentsextracted
Citation Turdi, HHangeland, JJLawrence, RMCheng, DAhmad, SMeng, WBrigance, RPDevasthale, PZhao, G Aryl dihydropyridinones and piperidinone MGAT2 inhibitors US Patent US9187424 Publication Date 11/17/2015
 
Alpha-1,6-mannosyl-glycoprotein 2-beta-N-acetylglucosaminyltransferase
Name:Alpha-1,6-mannosyl-glycoprotein 2-beta-N-acetylglucosaminyltransferase
Type:n/a
Mol. Mass.:51567.80
Organism:Homo sapiens (Human)
Description:Q10469
Residue:447
BDBM201317
NameBDBM201317
Synonyms:US9187424, 81 | US9187424, 91
TypeSmall organic molecule
Emp. Form.C24H19F7N2O3
Mol. Mass.516.4081
SMILESCOc1ccc(C2=C(C#N)C(=O)NC(C2)(c2ccc(OCCCC(F)(F)F)cc2)C(F)(F)F)c(F)c1