Reaction Details
TargetMitogen-activated protein kinase 1
LigandBDBM201601
Substrate/Competitorn/a
Meas. Tech.IMAP-FP Assay
IC50 0.2±n/a nM
Citation Wilson, KJWitter, DJSiliphaivanh, PLipford, KSloman, DFalcone, DO'Boyle, BMansoor, UFLim, JMethot, JLBoyce, CChen, LDaniels, MHFevrier, SHuang, XKurukulasuriya, RTong, LZhou, WKozlowski, JMaletic, MMShinkre, BAThatai, JTBakshi, RKKarunakaran, GB Compounds that are ERK inhibitors US Patent US9233979 Publication Date 1/12/2016
 
Mitogen-activated protein kinase 1
Name:Mitogen-activated protein kinase 1
Type:Ser/Thr Protein Kinase
Mol. Mass.:41392.76
Organism:Homo sapiens (Human)
Description:P28482
Residue:360
BDBM201601
NameBDBM201601
Synonyms:US9233979, 42
TypeSmall organic molecule
Emp. Form.C22H27N7O2
Mol. Mass.421.4955
SMILESCN1C[C@@H](NC(=O)Nc2cc3[nH]nc(N4CCOCC4)c3cn2)[C@H](C1)c1ccccc1