Reaction Details
TargetMitogen-activated protein kinase 1
LigandBDBM203326
Substrate/Competitorn/a
Meas. Tech.IMAP Assay
IC50 1.98±n/a nM
Citation Shipps, Jr., GWDeng, YCooper, ABGao, XSun, BWang, JZhu, L Fused pyrazole derivatives as novel ERK inhibitors US Patent US9242981 Publication Date 1/26/2016
 
Mitogen-activated protein kinase 1
Name:Mitogen-activated protein kinase 1
Type:Protein
Mol. Mass.:41278.65
Organism:Mus musculus (Mouse)
Description:P63085
Residue:358
BDBM203326
NameBDBM203326
Synonyms:US9242981, 58
TypeSmall organic molecule
Emp. Form.C23H28N6OS
Mol. Mass.436.573
SMILESCc1ccsc1CN1CCC[C@H](C1)NC(=O)N1CCc2[nH]nc(c2C1)-c1ccncc1