Reaction Details
TargetProtein O-GlcNAcase
LigandBDBM50323697
Substrate/Competitorn/a
Meas. Tech.n/a
pH7±n/a
Temperature298.15±n/a K
Ki 0.4±n/a nM
Commentsextracted
Citation Kaul, RMcEachern, EJSelnick, HGVocadlo, DJZhou, YZhu, Y Selective glycosidase inhibitors and uses thereof US Patent US9243020 Publication Date 1/26/2016
 
Protein O-GlcNAcase
Name:Protein O-GlcNAcase
Type:Enzyme
Mol. Mass.:102874.67
Organism:Homo sapiens (Human)
Description:O60502
Residue:916
BDBM50323697
NameBDBM50323697
Synonyms:(3AR,5R,6S,7R,7AR)-2-(ETHYLAMINO)-5-(HYDROXYMETHYL)-5,6,7,7A-TETRAHYDRO-3AH-PYRANO[3,2-D][1,3]THIAZOLE-6,7-DIOL US9243020, (3aR,5R,6S,7R,7aR)-2-(ethylamino)-5-(hydroxymethyl)-3aH,5H,6H,7H,7aH-pyrano[3,2-d][1,3]thiazole-6,7-diol US9815861, Example 098 | thiamet-G
TypeSmall organic molecule
Emp. Form.C9H16N2O4S
Mol. Mass.248.299
SMILESCCNC1=N[C@H]2[C@H](O[C@H](CO)[C@@H](O)[C@@H]2O)S1