Reaction Details
TargetApoptosis regulator Bcl-2 [1-204]
LigandBDBM156380
Substrate/Competitorn/a
Meas. Tech.Fluorescence Polarization Assay
pH7.5±n/a
IC50 0.5±n/a nM
Commentsextracted
Citation Diebold, RBGero, TWGrover, PHuang, SIoannidis, SOgoe, CASaeh, JC Chemical compounds US Patent US9248140 Publication Date 2/2/2016
 
Apoptosis regulator Bcl-2 [1-204]
Name:Apoptosis regulator Bcl-2 [1-204]
Type:Protein
Mol. Mass.:22461.03
Organism:Homo sapiens (Human)
Description:C-terminal 6XHIS tagged Bcl-2 (aa 1-204)
Residue:204
BDBM156380
NameBDBM156380
Synonyms:US9018381, 4 | US9248140, 4
TypeSmall organic molecule
Emp. Form.C46H50ClF3N4O7S3
Mol. Mass.959.555
SMILESCCN(CCO)CC[C@H](CSc1ccccc1)Nc1ccc(cc1S(=O)(=O)C(F)(F)F)S(=O)(=O)NC(=O)c1ccc(cc1)N1CCC(CC1)[C@@H](O)c1ccccc1-c1ccc(Cl)cc1