Reaction Details
TargetMitogen-activated protein kinase 14
LigandBDBM205294
Substrate/Competitorn/a
Meas. Tech.p38 MAPKα Enzyme Inhibition Assay
IC50 32±n/a nM
Citation Duffy, LAKing-Underwood, JLongshaw, AIMurray, PJOnions, STTaddei, DMWilliams, JGIto, KCharron, CE Pyrazole derivatives as p38 MAP inhibitors US Patent US9249125 Publication Date 2/2/2016
 
Mitogen-activated protein kinase 14
Name:Mitogen-activated protein kinase 14
Type:Serine/threonine-protein kinase
Mol. Mass.:41286.76
Organism:Homo sapiens (Human)
Description:Q16539
Residue:360
BDBM205294
NameBDBM205294
Synonyms:US9249125, 47
TypeSmall organic molecule
Emp. Form.C39H38N10O4
Mol. Mass.710.7836
SMILESCOc1ccc(cc1)-n1nc(cc1NC(=O)Nc1ccc(Oc2ccnc(Nc3ccc4[nH]nc(C(=O)N(C)C)c4c3)n2)c2ccccc12)C(C)(C)C