Reaction Details
TargetMitogen-activated protein kinase 14
LigandBDBM205315
Substrate/Competitorn/a
Meas. Tech.p38 MAPKα Enzyme Inhibition Assay
IC50 40±n/a nM
Citation Duffy, LAKing-Underwood, JLongshaw, AIMurray, PJOnions, STTaddei, DMWilliams, JGIto, KCharron, CE Pyrazole derivatives as p38 MAP inhibitors US Patent US9249125 Publication Date 2/2/2016
 
Mitogen-activated protein kinase 14
Name:Mitogen-activated protein kinase 14
Type:Serine/threonine-protein kinase
Mol. Mass.:41286.76
Organism:Homo sapiens (Human)
Description:Q16539
Residue:360
BDBM205315
NameBDBM205315
Synonyms:US9249125, 68
TypeSmall organic molecule
Emp. Form.C43H45N9O4
Mol. Mass.751.8753
SMILESCc1cc(Nc2cc(Oc3ccc(NC(=O)Nc4cc(nn4-c4ccc(OCCN5CCOCC5)cc4)C(C)(C)C)c4ccccc34)ccn2)cc2cn[nH]c12