Reaction Details
TargetMitogen-activated protein kinase 14
LigandBDBM205321
Substrate/Competitorn/a
Meas. Tech.p38 MAPKα Enzyme Inhibition Assay
IC50 27±n/a nM
Citation Duffy, LAKing-Underwood, JLongshaw, AIMurray, PJOnions, STTaddei, DMWilliams, JGIto, KCharron, CE Pyrazole derivatives as p38 MAP inhibitors US Patent US9249125 Publication Date 2/2/2016
 
Mitogen-activated protein kinase 14
Name:Mitogen-activated protein kinase 14
Type:Serine/threonine-protein kinase
Mol. Mass.:41286.76
Organism:Homo sapiens (Human)
Description:Q16539
Residue:360
BDBM205321
NameBDBM205321
Synonyms:US9249125, 74
TypeSmall organic molecule
Emp. Form.C47H53N11O5
Mol. Mass.851.9944
SMILESCC(C)(C)c1cc(NC(=O)Nc2ccc(Oc3ccnc(Nc4ccc5n(CCN6CCOCC6)ncc5c4)n3)c3ccccc23)n(n1)-c1ccc(OCCN2CCOCC2)cc1