Reaction Details
TargetProto-oncogene tyrosine-protein kinase Src
LigandBDBM205257
Substrate/Competitorn/a
Meas. Tech.c-Src and Syk Enzyme Inhibition Assay
IC50<1±n/a nM
Citation Duffy, LAKing-Underwood, JLongshaw, AIMurray, PJOnions, STTaddei, DMWilliams, JGIto, KCharron, CE Pyrazole derivatives as p38 MAP inhibitors US Patent US9249125 Publication Date 2/2/2016
 
Proto-oncogene tyrosine-protein kinase Src
Name:Proto-oncogene tyrosine-protein kinase Src
Type:Protein
Mol. Mass.:59838.60
Organism:Homo sapiens (Human)
Description:P12931
Residue:536
BDBM205257
NameBDBM205257
Synonyms:US9249125, 10
TypeSmall organic molecule
Emp. Form.C41H40N10O3
Mol. Mass.720.8215
SMILESCc1cc(Nc2nccc(Oc3ccc(NC(=O)Nc4cc(nn4-c4cccc(CN5CCCC5=O)c4)C(C)(C)C)c4ccccc34)n2)cc2cn[nH]c12