Reaction Details
TargetProto-oncogene tyrosine-protein kinase Src
LigandBDBM205305
Substrate/Competitorn/a
Meas. Tech.c-Src and Syk Enzyme Inhibition Assay
IC50<1±n/a nM
Citation Duffy, LAKing-Underwood, JLongshaw, AIMurray, PJOnions, STTaddei, DMWilliams, JGIto, KCharron, CE Pyrazole derivatives as p38 MAP inhibitors US Patent US9249125 Publication Date 2/2/2016
 
Proto-oncogene tyrosine-protein kinase Src
Name:Proto-oncogene tyrosine-protein kinase Src
Type:Protein
Mol. Mass.:59838.60
Organism:Homo sapiens (Human)
Description:P12931
Residue:536
BDBM205305
NameBDBM205305
Synonyms:US9249125, 58
TypeSmall organic molecule
Emp. Form.C41H43N9O3
Mol. Mass.709.8386
SMILESCN(C)CCOc1ccc(cc1)-n1nc(cc1NC(=O)Nc1ccc(Oc2ccnc(Nc3cc(C)c4[nH]ncc4c3)c2)c2ccccc12)C(C)(C)C