Reaction Details
TargetProto-oncogene tyrosine-protein kinase Src
LigandBDBM205315
Substrate/Competitorn/a
Meas. Tech.c-Src and Syk Enzyme Inhibition Assay
IC50 3±n/a nM
Citation Duffy, LAKing-Underwood, JLongshaw, AIMurray, PJOnions, STTaddei, DMWilliams, JGIto, KCharron, CE Pyrazole derivatives as p38 MAP inhibitors US Patent US9249125 Publication Date 2/2/2016
 
Proto-oncogene tyrosine-protein kinase Src
Name:Proto-oncogene tyrosine-protein kinase Src
Type:Protein
Mol. Mass.:59838.60
Organism:Homo sapiens (Human)
Description:P12931
Residue:536
BDBM205315
NameBDBM205315
Synonyms:US9249125, 68
TypeSmall organic molecule
Emp. Form.C43H45N9O4
Mol. Mass.751.8753
SMILESCc1cc(Nc2cc(Oc3ccc(NC(=O)Nc4cc(nn4-c4ccc(OCCN5CCOCC5)cc4)C(C)(C)C)c4ccccc34)ccn2)cc2cn[nH]c12