Reaction Details
TargetProto-oncogene tyrosine-protein kinase Src
LigandBDBM205331
Substrate/Competitorn/a
Meas. Tech.c-Src and Syk Enzyme Inhibition Assay
IC50 3±n/a nM
Citation Duffy, LAKing-Underwood, JLongshaw, AIMurray, PJOnions, STTaddei, DMWilliams, JGIto, KCharron, CE Pyrazole derivatives as p38 MAP inhibitors US Patent US9249125 Publication Date 2/2/2016
 
Proto-oncogene tyrosine-protein kinase Src
Name:Proto-oncogene tyrosine-protein kinase Src
Type:Protein
Mol. Mass.:59838.60
Organism:Homo sapiens (Human)
Description:P12931
Residue:536
BDBM205331
NameBDBM205331
Synonyms:US9249125, 84
TypeSmall organic molecule
Emp. Form.C35H32N10O4
Mol. Mass.656.6932
SMILESCC(C)c1cc(NC(=O)Nc2ccc(Oc3cc(Nc4ccc5[nH]ncc5c4)ncn3)c3ccccc23)n(n1)-c1ccc(=O)n(CCO)c1