Reaction Details
TargetProto-oncogene tyrosine-protein kinase Src
LigandBDBM205337
Substrate/Competitorn/a
Meas. Tech.c-Src and Syk Enzyme Inhibition Assay
IC50<1±n/a nM
Citation Duffy, LAKing-Underwood, JLongshaw, AIMurray, PJOnions, STTaddei, DMWilliams, JGIto, KCharron, CE Pyrazole derivatives as p38 MAP inhibitors US Patent US9249125 Publication Date 2/2/2016
 
Proto-oncogene tyrosine-protein kinase Src
Name:Proto-oncogene tyrosine-protein kinase Src
Type:Protein
Mol. Mass.:59838.60
Organism:Homo sapiens (Human)
Description:P12931
Residue:536
BDBM205337
NameBDBM205337
Synonyms:US9249125, 90
TypeSmall organic molecule
Emp. Form.C41H42N10O5
Mol. Mass.754.8362
SMILESCC(C)(C)c1cc(NC(=O)Nc2ccc(Oc3ccnc(Nc4ccc5CC(=O)Nc5c4)n3)c3ccccc23)n(n1)-c1ccc(OCCN2CCOCC2)nc1