Reaction Details
TargetProto-oncogene tyrosine-protein kinase Src
LigandBDBM205338
Substrate/Competitorn/a
Meas. Tech.c-Src and Syk Enzyme Inhibition Assay
IC50 1±n/a nM
Citation Duffy, LAKing-Underwood, JLongshaw, AIMurray, PJOnions, STTaddei, DMWilliams, JGIto, KCharron, CE Pyrazole derivatives as p38 MAP inhibitors US Patent US9249125 Publication Date 2/2/2016
 
Proto-oncogene tyrosine-protein kinase Src
Name:Proto-oncogene tyrosine-protein kinase Src
Type:Protein
Mol. Mass.:59838.60
Organism:Homo sapiens (Human)
Description:P12931
Residue:536
BDBM205338
NameBDBM205338
Synonyms:US9249125, 91
TypeSmall organic molecule
Emp. Form.C41H43N11O4
Mol. Mass.753.8514
SMILESCc1cc(Nc2nccc(Oc3ccc(NC(=O)Nc4cc(nn4-c4ccc(OCCN5CCOCC5)nc4)C(C)(C)C)c4ccccc34)n2)cc2cn[nH]c12