Reaction Details
TargetGlycogen synthase kinase-3 alpha
LigandBDBM205294
Substrate/Competitorn/a
Meas. Tech.GSK 3α Enzyme Inhibition Assay
IC50 472±n/a nM
Citation Duffy, LAKing-Underwood, JLongshaw, AIMurray, PJOnions, STTaddei, DMWilliams, JGIto, KCharron, CE Pyrazole derivatives as p38 MAP inhibitors US Patent US9249125 Publication Date 2/2/2016
 
Glycogen synthase kinase-3 alpha
Name:Glycogen synthase kinase-3 alpha
Type:Enzyme
Mol. Mass.:50991.79
Organism:Homo sapiens (Human)
Description:P49840
Residue:483
BDBM205294
NameBDBM205294
Synonyms:US9249125, 47
TypeSmall organic molecule
Emp. Form.C39H38N10O4
Mol. Mass.710.7836
SMILESCOc1ccc(cc1)-n1nc(cc1NC(=O)Nc1ccc(Oc2ccnc(Nc3ccc4[nH]nc(C(=O)N(C)C)c4c3)n2)c2ccccc12)C(C)(C)C