Reaction Details
TargetGlycogen synthase kinase-3 alpha
LigandBDBM205303
Substrate/Competitorn/a
Meas. Tech.GSK 3α Enzyme Inhibition Assay
IC50>13300±n/a nM
Citation Duffy, LAKing-Underwood, JLongshaw, AIMurray, PJOnions, STTaddei, DMWilliams, JGIto, KCharron, CE Pyrazole derivatives as p38 MAP inhibitors US Patent US9249125 Publication Date 2/2/2016
 
Glycogen synthase kinase-3 alpha
Name:Glycogen synthase kinase-3 alpha
Type:Enzyme
Mol. Mass.:50991.79
Organism:Homo sapiens (Human)
Description:P49840
Residue:483
BDBM205303
NameBDBM205303
Synonyms:US9249125, 56
TypeSmall organic molecule
Emp. Form.C42H44N10O4
Mol. Mass.752.8634
SMILESCc1cc(Nc2nccc(Oc3ccc(NC(=O)Nc4cc(nn4-c4cccc(OCCN5CCOCC5)c4)C(C)(C)C)c4ccccc34)n2)cc2cn[nH]c12