Reaction Details
TargetBromodomain-containing protein 4 [44-168,333-460]
LigandBDBM205435
Substrate/Competitorn/a
Meas. Tech.BROMOscan Assay
Kd 0.0059±0.0 nM
Citation Tanaka, MRoberts, JMSeo, HSSouza, APaulk, JScott, TGDeAngelo, SLDhe-Paganon, SBradner, JE Design and characterization of bivalent BET inhibitors. Nat Chem Biol12:1089-1096 (2016) 
 
Bromodomain-containing protein 4 [44-168,333-460]
Name:Bromodomain-containing protein 4 [44-168,333-460]
Type:n/a
Mol. Mass.:29666.85
Organism:Homo sapiens (Human)
Description:O60885 (BRD4, 44-168 and 333-460)
Residue:253
BDBM205435
NameBDBM205435
Synonyms:(6S+2S)-PEG7 (11)
TypeSmall organic molecule
Emp. Form.C55H66Cl2N10O11S2
Mol. Mass.1178.209
SMILESCOC(=O)C[C@@H]1N=C(c2c(C)c(sc2-n2c(C)nnc12)C(=O)NCCOCCOCCOCCOCCOCCOCCOCCNC(=O)C[C@@H]1N=C(c2c(C)c(C)sc2-n2c(C)nnc12)c1ccc(Cl)cc1)c1ccc(Cl)cc1