Reaction Details
TargetTyrosine-protein kinase SYK
LigandBDBM50040727
Substrate/Competitorn/a
Meas. Tech.In vitro SYK Kinase Assay
pH7.2±n/a
Temperature298.15±n/a K
IC50 410±n/a nM
Commentsextracted
Citation Arora, NChen, SHermann, JCKuglstatter, ALabadie, SSLin, CJLucas, MCMoore, AGPapp, ETalamas, FXWanner, JZhai, Y Pyrazolo[1,5a]pyrimidine derivatives as IRAK4 modulators US Patent US9255110 Publication Date 2/9/2016
 
Tyrosine-protein kinase SYK
Name:Tyrosine-protein kinase SYK
Type:Enzyme
Mol. Mass.:72079.99
Organism:Homo sapiens (Human)
Description:P43405
Residue:635
BDBM50040727
NameBDBM50040727
Synonyms:CHEMBL3353220 | US9255110, 7
TypeSmall organic molecule
Emp. Form.C20H20N6O2S
Mol. Mass.408.477
SMILESCOc1cc2ncccc2cc1NC(=O)c1csc2cnc(nc12)N(C)CCN