Reaction Details
TargetMitogen-activated protein kinase 1
LigandBDBM120103
Substrate/Competitorn/a
Meas. Tech.ERK-2 Enzymatic Assay
pH7.3±n/a
IC50 3±n/a nM
Commentsextracted
Citation Blake, JFChicarelli, MJGarrey, RFGaudino, JGrina, JMoreno, DAMohr, PJRen, LSchwarz, JChen, HRobarge, KZhou, A Serine/threonine kinase inhibitors US Patent US9259470 Publication Date 2/16/2016
 
Mitogen-activated protein kinase 1
Name:Mitogen-activated protein kinase 1
Type:Ser/Thr Protein Kinase
Mol. Mass.:41392.76
Organism:Homo sapiens (Human)
Description:P28482
Residue:360
BDBM120103
NameBDBM120103
Synonyms:US8697715, 87 | US9259470, 87
TypeSmall organic molecule
Emp. Form.C23H26N4O3
Mol. Mass.406.4775
SMILESCc1cccc(c1)C(CO)n1ccc(cc1=O)-c1ccnc(NC2CCOCC2)n1