Reaction Details
TargetSerine/threonine-protein kinase pim-1
LigandBDBM206587
Substrate/Competitorn/a
Meas. Tech.PIM Kinase Binding Activity Assay
pH7.2±n/a
Ki 0.01±n/a nM
Commentsextracted
Citation Do, SHu, HKolesnikov, ALee, WTsui, VHWang, XWen, Z Pyrazolo[3,4-c]pyridine compounds and methods of use US Patent US9260425 Publication Date 2/16/2016
 
Serine/threonine-protein kinase pim-1
Name:Serine/threonine-protein kinase pim-1
Type:Protein
Mol. Mass.:35681.82
Organism:Homo sapiens (Human)
Description:P11309
Residue:313
BDBM206587
NameBDBM206587
Synonyms:US9260425, 342
TypeSmall organic molecule
Emp. Form.C23H21N7
Mol. Mass.395.4597
SMILESN[C@H]1CCCN(C1)c1nc(ccc1C#C)-c1n[nH]c2cnc(cc12)-c1cccnc1